Trying to mod MC Forge 1.12.2, but SetupDecompWorkspace not working
I am trying to make a mod for Minecraft Forge 1.12.2, mdk file forge-1.12.2-14.23.5.2854-mdk. Problem is, when i right-click inside this folder, open Powershell and run the ./gradlew setupDecompWorkspace eclipse command, it comes up with an error log:
forge-1.12.2-14.23.5.2854-mdk> ./gradlew setupDecompWorkspace eclipse To honour the JVM settings for this build a new JVM will be forked. Please consider using the daemon: https://docs.gradlDaemon will be stopped at the end of the build stopping after processing
FAILURE: Build failed with an exception.
- What went wrong: A problem occurred configuring root project ‘forge-1.12.2-14.23.5.2854-mdk’.
Could not resolve all artifacts for configuration ‘:classpath’. Could not resolve net.minecraftforge.gradle:ForgeGradle:3.+. Required by: project : > Failed to list versions for net.minecraftforge.gradle:ForgeGradle. > Unable to load Maven meta-data from https://files.minecraftforge.net/maven/net/minecraftforge/gradle/ForgeGradle/maven-metadata.xml. > Could not get resource ‘https://files.minecraftforge.net/maven/net/minecraftforge/gradle/ForgeGradle/maven-metadata.xml’. > Could not GET ‘https://files.minecraftforge.net/maven/net/minecraftforge/gradle/ForgeGradle/maven-metadata.xml’. > sun.security.validator.ValidatorException: PKIX path building failed: sun.security.provider.certpath.SunCertPathBuilderException: unable to find valid certification path to requested target > Failed to list versions for net.minecraftforge.gradle:ForgeGradle. > Unable to load Maven meta-data from https://jcenter.bintray.com/net/minecraftforge/gradle/ForgeGradle/maven-metadata.xml. > Could not get resource ‘https://jcenter.bintray.com/net/minecraftforge/gradle/ForgeGradle/maven-metadata.xml’. > Could not GET ‘https://jcenter.bintray.com/net/minecraftforge/gradle/ForgeGradle/maven-metadata.xml’. > sun.security.validator.ValidatorException: PKIX path building failed: sun.security.provider.certpath.SunCertPathBuilderException: unable to find valid certification path to requested target > Failed to list versions for net.minecraftforge.gradle:ForgeGradle. > Unable to load Maven meta-data from https://repo.maven.apache.org/maven2/net/minecraftforge/gradle/ForgeGradle/maven-metadata.xml. > Could not get resource ‘https://repo.maven.apache.org/maven2/net/minecraftforge/gradle/ForgeGradle/maven-metadata.xml’. > Could not GET ‘https://repo.maven.apache.org/maven2/net/minecraftforge/gradle/ForgeGradle/maven-metadata.xml’. > sun.security.validator.ValidatorException: PKIX path building failed: sun.security.provider.certpath.SunCertPathBuilderException: unable to find valid certification path to requested target
Try: Run with —stacktrace option to get the stack trace. Run with —info or —debug option to get more log output. Run with —scan to get full insights.
BUILD FAILED in 6s
Could somebody please help me with this? I am not sure what else to try.
Источник
Problems running gradlew.bat and setting up Development Environment
I’ve recently gotten into modding Minecraft 1.7.10, and I’m setting up my folders/environment. All I’ve done so far is as follows;
- Extracted the 1.7.10 src files from the forge website to the file I plan on modding in.
- made a system variable in my environmental variables called Path, which directs to my JDK.
- Ran gradlew.bat (failed)
And this is where I failed. I have the main error I got straight from the cmd prompt, used cmd /k switch to keep it open listed below.
FAILURE: Build failed with an exception.
- What went wrong: A problem occurred configuring root project ‘Modding Project’.
Could not resolve all dependencies for configuration ‘:classpath’. Could not resolve org.eclipse.equinox:common:[3.2.0,4.0.0). Required by: :Modding Project:unspecified > net.minecraftforge.gradle:ForgeGradle:1.2-SNAPSHOT > net.minecraftforge.srg2source:Srg2Source:3.2-SNAPSHOT > org.eclipse.core:jobs:3.5.300-v20130429-1813 :Modding Project:unspecified > net.minecraftforge.gradle:ForgeGradle:1.2-SNAPSHOT > net.minecraftforge.srg2source:Srg2Source:3.2-SNAPSHOT > org.eclipse.core:contenttype:3.4.200-v20130326-1255 :Modding Project:unspecified > net.minecraftforge.gradle:ForgeGradle:1.2-SNAPSHOT > net.minecraftforge.srg2source:Srg2Source:3.2-SNAPSHOT > org.eclipse.equinox:preferences:3.5.100-v20130422-1538 > Failed to list versions for org.eclipse.equinox:common. > Unable to load Maven meta-data from http://repo1.maven.org/maven2/org/eclipse/equinox/common/maven-metadata.xml. > Could not GET ‘http://repo1.maven.org/maven2/org/eclipse/equinox/common/maven-metadata.xml’. Received status code 501 from server: HTTPS Required Could not resolve org.eclipse.equinox:preferences:[3.2.0,4.0.0). Required by: :Modding Project:unspecified > net.minecraftforge.gradle:ForgeGradle:1.2-SNAPSHOT > net.minecraftforge.srg2source:Srg2Source:3.2-SNAPSHOT > org.eclipse.core:contenttype:3.4.200-v20130326-1255 > Failed to list versions for org.eclipse.equinox:preferences. > Unable to load Maven meta-data from http://repo1.maven.org/maven2/org/eclipse/equinox/preferences/maven-metadata.xml. > Could not GET ‘http://repo1.maven.org/maven2/org/eclipse/equinox/preferences/maven-metadata.xml’. Received status code 501 from server: HTTPS Required Could not resolve org.eclipse.equinox:registry:[3.2.0,4.0.0). Required by: :Modding Project:unspecified > net.minecraftforge.gradle:ForgeGradle:1.2-SNAPSHOT > net.minecraftforge.srg2source:Srg2Source:3.2-SNAPSHOT > org.eclipse.core:contenttype:3.4.200-v20130326-1255 > Failed to list versions for org.eclipse.equinox:registry. > Unable to load Maven meta-data from http://repo1.maven.org/maven2/org/eclipse/equinox/registry/maven-metadata.xml. > Could not GET ‘http://repo1.maven.org/maven2/org/eclipse/equinox/registry/maven-metadata.xml’. Received status code 501 from server: HTTPS Required Could not resolve org.eclipse.core.runtime:compatibility:[3.1.0,4.0.0). Required by: :Modding Project:unspecified > net.minecraftforge.gradle:ForgeGradle:1.2-SNAPSHOT > net.minecraftforge.srg2source:Srg2Source:3.2-SNAPSHOT > org.eclipse.core:resources:3.2.1-R32x_v20060914 > Failed to list versions for org.eclipse.core.runtime:compatibility. > Unable to load Maven meta-data from http://repo1.maven.org/maven2/org/eclipse/core/runtime/compatibility/maven-metadata.xml. > Could not GET ‘http://repo1.maven.org/maven2/org/eclipse/core/runtime/compatibility/maven-metadata.xml’. Received status code 501 from server: HTTPS Required Could not resolve org.eclipse.core:expressions:[3.1.0,4.0.0). Required by: :Modding Project:unspecified > net.minecraftforge.gradle:ForgeGradle:1.2-SNAPSHOT > net.minecraftforge.srg2source:Srg2Source:3.2-SNAPSHOT > org.eclipse.core:resources:3.2.1-R32x_v20060914 > Failed to list versions for org.eclipse.core:expressions. > Unable to load Maven meta-data from http://repo1.maven.org/maven2/org/eclipse/core/expressions/maven-metadata.xml. > Could not GET ‘http://repo1.maven.org/maven2/org/eclipse/core/expressions/maven-metadata.xml’. Received status code 501 from server: HTTPS Required Could not resolve org.eclipse.core:filesystem:[1.0.0,2.0.0). Required by: :Modding Project:unspecified > net.minecraftforge.gradle:ForgeGradle:1.2-SNAPSHOT > net.minecraftforge.srg2source:Srg2Source:3.2-SNAPSHOT > org.eclipse.core:resources:3.2.1-R32x_v20060914 > Failed to list versions for org.eclipse.core:filesystem. > Unable to load Maven meta-data from http://repo1.maven.org/maven2/org/eclipse/core/filesystem/maven-metadata.xml. > Could not GET ‘http://repo1.maven.org/maven2/org/eclipse/core/filesystem/maven-metadata.xml’. Received status code 501 from server: HTTPS Required Could not resolve org.eclipse:osgi:[3.7.0,4.0.0). Required by: :Modding Project:unspecified > net.minecraftforge.gradle:ForgeGradle:1.2-SNAPSHOT > net.minecraftforge.srg2source:Srg2Source:3.2-SNAPSHOT > org.eclipse.core:runtime:3.9.0-v20130326-1255 > Failed to list versions for org.eclipse:osgi. > Unable to load Maven meta-data from http://repo1.maven.org/maven2/org/eclipse/osgi/maven-metadata.xml. > Could not GET ‘http://repo1.maven.org/maven2/org/eclipse/osgi/maven-metadata.xml’. Received status code 501 from server: HTTPS Required Could not resolve org.eclipse.equinox:common:[3.6.100,4.0.0). Required by: :Modding Project:unspecified > net.minecraftforge.gradle:ForgeGradle:1.2-SNAPSHOT > net.minecraftforge.srg2source:Srg2Source:3.2-SNAPSHOT > org.eclipse.core:runtime:3.9.0-v20130326-1255 > Failed to list versions for org.eclipse.equinox:common. > Unable to load Maven meta-data from http://repo1.maven.org/maven2/org/eclipse/equinox/common/maven-metadata.xml. > Could not GET ‘http://repo1.maven.org/maven2/org/eclipse/equinox/common/maven-metadata.xml’. Received status code 501 from server: HTTPS Required Could not resolve org.eclipse.core:jobs:[3.2.0,4.0.0). Required by: :Modding Project:unspecified > net.minecraftforge.gradle:ForgeGradle:1.2-SNAPSHOT > net.minecraftforge.srg2source:Srg2Source:3.2-SNAPSHOT > org.eclipse.core:runtime:3.9.0-v20130326-1255 > Failed to list versions for org.eclipse.core:jobs. > Unable to load Maven meta-data from http://repo1.maven.org/maven2/org/eclipse/core/jobs/maven-metadata.xml. > Could not GET ‘http://repo1.maven.org/maven2/org/eclipse/core/jobs/maven-metadata.xml’. Received status code 501 from server: HTTPS Required Could not resolve org.eclipse.equinox:registry:[3.4.0,4.0.0). Required by: :Modding Project:unspecified > net.minecraftforge.gradle:ForgeGradle:1.2-SNAPSHOT > net.minecraftforge.srg2source:Srg2Source:3.2-SNAPSHOT > org.eclipse.core:runtime:3.9.0-v20130326-1255 > Failed to list versions for org.eclipse.equinox:registry. > Unable to load Maven meta-data from http://repo1.maven.org/maven2/org/eclipse/equinox/registry/maven-metadata.xml. > Could not GET ‘http://repo1.maven.org/maven2/org/eclipse/equinox/registry/maven-metadata.xml’. Received status code 501 from server: HTTPS Required Could not resolve org.eclipse.equinox:preferences:[3.4.0,4.0.0). Required by: :Modding Project:unspecified > net.minecraftforge.gradle:ForgeGradle:1.2-SNAPSHOT > net.minecraftforge.srg2source:Srg2Source:3.2-SNAPSHOT > org.eclipse.core:runtime:3.9.0-v20130326-1255 > Failed to list versions for org.eclipse.equinox:preferences. > Unable to load Maven meta-data from http://repo1.maven.org/maven2/org/eclipse/equinox/preferences/maven-metadata.xml. > Could not GET ‘http://repo1.maven.org/maven2/org/eclipse/equinox/preferences/maven-metadata.xml’. Received status code 501 from server: HTTPS Required Could not resolve org.eclipse.core:contenttype:[3.3.0,4.0.0). Required by: :Modding Project:unspecified > net.minecraftforge.gradle:ForgeGradle:1.2-SNAPSHOT > net.minecraftforge.srg2source:Srg2Source:3.2-SNAPSHOT > org.eclipse.core:runtime:3.9.0-v20130326-1255 > Failed to list versions for org.eclipse.core:contenttype. > Unable to load Maven meta-data from http://repo1.maven.org/maven2/org/eclipse/core/contenttype/maven-metadata.xml. > Could not GET ‘http://repo1.maven.org/maven2/org/eclipse/core/contenttype/maven-metadata.xml’. Received status code 501 from server: HTTPS Required Could not resolve org.eclipse.equinox:app:[1.0.0,2.0.0). Required by: :Modding Project:unspecified > net.minecraftforge.gradle:ForgeGradle:1.2-SNAPSHOT > net.minecraftforge.srg2source:Srg2Source:3.2-SNAPSHOT > org.eclipse.core:runtime:3.9.0-v20130326-1255 > Failed to list versions for org.eclipse.equinox:app. > Unable to load Maven meta-data from http://repo1.maven.org/maven2/org/eclipse/equinox/app/maven-metadata.xml. > Could not GET ‘http://repo1.maven.org/maven2/org/eclipse/equinox/app/maven-metadata.xml’. Received status code 501 from server: HTTPS Required
- Try: Run with —stacktrace option to get the stack trace. Run with —info or —debug option to get more log output.
Total time: 10.107 secs
I can provide the —stacktrace, —info or the —debug on request.. first post so I’m not sure what people need beyond the error. Thanks anyways!
Here is my build.gradle
Now here is my NEW build.gradle thanks to your help, narrowing it down now.
FAILURE: Build failed with an exception.
- What went wrong: A problem occurred configuring root project ‘Modding Project’.
Источник
Не работает gradlew.bat setupDecompWorkspace eclipse
1kovand1
Решил начать писать моды. Делал все как тут
minecraft-ru.gamepedia.com/Создание_модификаций_с_помощью_Forge/1.7%2B .
Но все пошло наперекосяк с первого же этапа-установки рабочей среды
Я писал gradlew.bat setupDecompWorkspace но на стадии decompMinecraft выдавало ошибку.
Вот лог запуска с флагом —stacktrace
FAILURE: Build failed with an exception.
* What went wrong:
A problem occurred configuring root project ‘╠юфшэу’.
> Could not resolve all dependencies for configuration ‘:classpath’.
> Timeout waiting to lock artifact cache (C:\Users\Vasilich\.gradle\caches\mo
dules-2). It is currently in use by another Gradle instance.
Owner PID: 4904
Our PID: 6280
Owner Operation: resolve configuration ‘:classpath’
Our operation: resolve configuration ‘:classpath’
Lock file: C:\Users\Vasilich\.gradle\caches\modules-2\modules-2.lock
* Try:
Run with —info or —debug option to get more log output.
* Exception is:
org.gradle.api.ProjectConfigurationException: A problem occurred configuring roo
t project ‘╠юфшэу’.
at org.gradle.configuration.project.LifecycleProjectEvaluator.addConfigu
rationFailure(LifecycleProjectEvaluator.java:79)
at org.gradle.configuration.project.LifecycleProjectEvaluator.evaluate(L
ifecycleProjectEvaluator.java:57)
at org.gradle.api.internal.project.AbstractProject.evaluate(AbstractProj
ect.java:491)
at org.gradle.api.internal.project.AbstractProject.evaluate(AbstractProj
ect.java:89)
at org.gradle.execution.TaskPathProjectEvaluator.configureHierarchy(Task
PathProjectEvaluator.java:42)
at org.gradle.configuration.DefaultBuildConfigurer.configure(DefaultBuil
dConfigurer.java:35)
at org.gradle.initialization.DefaultGradleLauncher$2.run(DefaultGradleLa
uncher.java:126)
at org.gradle.internal.Factories$1.create(Factories.java:22)
at org.gradle.internal.progress.DefaultBuildOperationExecutor.run(Defaul
tBuildOperationExecutor.java:90)
at org.gradle.internal.progress.DefaultBuildOperationExecutor.run(Defaul
tBuildOperationExecutor.java:52)
at org.gradle.initialization.DefaultGradleLauncher.doBuildStages(Default
GradleLauncher.java:123)
at org.gradle.initialization.DefaultGradleLauncher.access$200(DefaultGra
dleLauncher.java:33)
at org.gradle.initialization.DefaultGradleLauncher$1.create(DefaultGradl
eLauncher.java:100)
at org.gradle.initialization.DefaultGradleLauncher$1.create(DefaultGradl
eLauncher.java:94)
at org.gradle.internal.progress.DefaultBuildOperationExecutor.run(Defaul
tBuildOperationExecutor.java:90)
at org.gradle.internal.progress.DefaultBuildOperationExecutor.run(Defaul
tBuildOperationExecutor.java:62)
at org.gradle.initialization.DefaultGradleLauncher.doBuild(DefaultGradle
Launcher.java:94)
at org.gradle.initialization.DefaultGradleLauncher.run(DefaultGradleLaun
cher.java:83)
at org.gradle.launcher.exec.InProcessBuildActionExecuter$DefaultBuildCon
troller.run(InProcessBuildActionExecuter.java:94)
at org.gradle.tooling.internal.provider.ExecuteBuildActionRunner.run(Exe
cuteBuildActionRunner.java:28)
at org.gradle.launcher.exec.ChainingBuildActionRunner.run(ChainingBuildA
ctionRunner.java:35)
at org.gradle.launcher.exec.InProcessBuildActionExecuter.execute(InProce
ssBuildActionExecuter.java:43)
at org.gradle.launcher.exec.InProcessBuildActionExecuter.execute(InProce
ssBuildActionExecuter.java:28)
at org.gradle.launcher.exec.ContinuousBuildActionExecuter.execute(Contin
uousBuildActionExecuter.java:77)
at org.gradle.launcher.exec.ContinuousBuildActionExecuter.execute(Contin
uousBuildActionExecuter.java:47)
at org.gradle.launcher.exec.DaemonUsageSuggestingBuildActionExecuter.exe
cute(DaemonUsageSuggestingBuildActionExecuter.java:51)
at org.gradle.launcher.exec.DaemonUsageSuggestingBuildActionExecuter.exe
cute(DaemonUsageSuggestingBuildActionExecuter.java:28)
at org.gradle.launcher.cli.RunBuildAction.run(RunBuildAction.java:43)
at org.gradle.internal.Actions$RunnableActionAdapter.execute(Actions.jav
a:170)
at org.gradle.launcher.cli.CommandLineActionFactory$ParseAndBuildAction.
execute(CommandLineActionFactory.java:237)
at org.gradle.launcher.cli.CommandLineActionFactory$ParseAndBuildAction.
execute(CommandLineActionFactory.java:210)
at org.gradle.launcher.cli.JavaRuntimeValidationAction.execute(JavaRunti
meValidationAction.java:35)
at org.gradle.launcher.cli.JavaRuntimeValidationAction.execute(JavaRunti
meValidationAction.java:24)
at org.gradle.launcher.cli.CommandLineActionFactory$WithLogging.execute(
CommandLineActionFactory.java:206)
at org.gradle.launcher.cli.CommandLineActionFactory$WithLogging.execute(
CommandLineActionFactory.java:169)
at org.gradle.launcher.cli.ExceptionReportingAction.execute(ExceptionRep
ortingAction.java:33)
at org.gradle.launcher.cli.ExceptionReportingAction.execute(ExceptionRep
ortingAction.java:22)
at org.gradle.launcher.Main.doAction(Main.java:33)
at org.gradle.launcher.bootstrap.EntryPoint.run(EntryPoint.java:45)
at org.gradle.launcher.bootstrap.ProcessBootstrap.runNoExit(ProcessBoots
trap.java:54)
at org.gradle.launcher.bootstrap.ProcessBootstrap.run(ProcessBootstrap.j
ava:35)
at org.gradle.launcher.GradleMain.main(GradleMain.java:23)
at org.gradle.wrapper.BootstrapMainStarter.start(BootstrapMainStarter.ja
va:30)
at org.gradle.wrapper.WrapperExecutor.execute(WrapperExecutor.java:127)
at org.gradle.wrapper.GradleWrapperMain.main(GradleWrapperMain.java:61)
Caused by: org.gradle.api.artifacts.ResolveException: Could not resolve all depe
ndencies for configuration ‘:classpath’.
at org.gradle.api.internal.artifacts.ivyservice.ErrorHandlingConfigurati
onResolver.wrapException(ErrorHandlingConfigurationResolver.java:70)
at org.gradle.api.internal.artifacts.ivyservice.ErrorHandlingConfigurati
onResolver.resolve(ErrorHandlingConfigurationResolver.java:45)
at org.gradle.api.internal.artifacts.configurations.DefaultConfiguration
.resolveGraphIfRequired(DefaultConfiguration.java:359)
at org.gradle.api.internal.artifacts.configurations.DefaultConfiguration
.resolveNow(DefaultConfiguration.java:334)
at org.gradle.api.internal.artifacts.configurations.DefaultConfiguration
.getResolvedConfiguration(DefaultConfiguration.java:327)
at org.gradle.api.internal.artifacts.configurations.DefaultConfiguration
_Decorated.getResolvedConfiguration(Unknown Source)
at org.gradle.api.internal.artifacts.configurations.DefaultConfiguration
$ConfigurationFileCollection.getFiles(DefaultConfiguration.java:642)
at org.gradle.api.internal.artifacts.configurations.DefaultConfiguration
.getFiles(DefaultConfiguration.java:280)
at org.gradle.api.internal.artifacts.configurations.DefaultConfiguration
_Decorated.getFiles(Unknown Source)
at org.gradle.api.internal.initialization.DefaultScriptHandler.getScript
ClassPath(DefaultScriptHandler.java:67)
at org.gradle.plugin.use.internal.DefaultPluginRequestApplicator.defineS
criptHandlerClassScope(DefaultPluginRequestApplicator.java:141)
at org.gradle.plugin.use.internal.DefaultPluginRequestApplicator.applyPl
ugins(DefaultPluginRequestApplicator.java:54)
at org.gradle.configuration.DefaultScriptPluginFactory$ScriptPluginImpl.
apply(DefaultScriptPluginFactory.java:127)
at org.gradle.configuration.project.BuildScriptProcessor.execute(BuildSc
riptProcessor.java:38)
at org.gradle.configuration.project.BuildScriptProcessor.execute(BuildSc
riptProcessor.java:25)
at org.gradle.configuration.project.ConfigureActionsProjectEvaluator.eva
luate(ConfigureActionsProjectEvaluator.java:34)
at org.gradle.configuration.project.LifecycleProjectEvaluator.evaluate(L
ifecycleProjectEvaluator.java:55)
. 43 more
Caused by: org.gradle.cache.internal.LockTimeoutException: Timeout waiting to lo
ck artifact cache (C:\Users\Vasilich\.gradle\caches\modules-2). It is currently
in use by another Gradle instance.
Owner PID: 4904
Our PID: 6280
Owner Operation: resolve configuration ‘:classpath’
Our operation: resolve configuration ‘:classpath’
Lock file: C:\Users\Vasilich\.gradle\caches\modules-2\modules-2.lock
at org.gradle.cache.internal.DefaultFileLockManager$DefaultFileLock.lock
(DefaultFileLockManager.java:258)
at org.gradle.cache.internal.DefaultFileLockManager$DefaultFileLock. (DefaultFileLockManager.java:127)
at org.gradle.cache.internal.DefaultFileLockManager.lock(DefaultFileLock
Manager.java:80)
at org.gradle.cache.internal.DefaultCacheAccess.onStartWork(DefaultCache
Access.java:349)
at org.gradle.cache.internal.DefaultCacheAccess.useCache(DefaultCacheAcc
ess.java:187)
at org.gradle.cache.internal.DefaultCacheAccess.useCache(DefaultCacheAcc
ess.java:175)
at org.gradle.cache.internal.DefaultPersistentDirectoryStore.useCache(De
faultPersistentDirectoryStore.java:106)
at org.gradle.cache.internal.DefaultCacheFactory$ReferenceTrackingCache.
useCache(DefaultCacheFactory.java:187)
at org.gradle.api.internal.artifacts.ivyservice.DefaultCacheLockingManag
er.useCache(DefaultCacheLockingManager.java:64)
at org.gradle.api.internal.artifacts.ivyservice.CacheLockingArtifactDepe
ndencyResolver.resolve(CacheLockingArtifactDependencyResolver.java:39)
at org.gradle.api.internal.artifacts.ivyservice.DefaultConfigurationReso
lver.resolve(DefaultConfigurationResolver.java:91)
at org.gradle.api.internal.artifacts.ivyservice.SelfResolvingDependencyC
onfigurationResolver.resolve(SelfResolvingDependencyConfigurationResolver.java:4
0)
at org.gradle.api.internal.artifacts.ivyservice.ShortCircuitEmptyConfigu
rationResolver.resolve(ShortCircuitEmptyConfigurationResolver.java:52)
at org.gradle.api.internal.artifacts.ivyservice.ErrorHandlingConfigurati
onResolver.resolve(ErrorHandlingConfigurationResolver.java:43)
. 58 more
C:\Users\Vasilich\Desktop\Модинг>gradlew.bat setupDecompWorkspace —stacktrace >
log.txt
FAILURE: Build failed with an exception.
* What went wrong:
A problem occurred configuring root project ‘╠юфшэу’.
> Could not resolve all dependencies for configuration ‘:classpath’.
> Timeout waiting to lock artifact cache (C:\Users\Vasilich\.gradle\caches\mo
dules-2). It is currently in use by another Gradle instance.
Owner PID: 4904
Our PID: 6280
Owner Operation: resolve configuration ‘:classpath’
Our operation: resolve configuration ‘:classpath’
Lock file: C:\Users\Vasilich\.gradle\caches\modules-2\modules-2.lock
* Try:
Run with —info or —debug option to get more log output.
Источник